{"text_format":"1","workbook":"xlsx","n_sheets":3,"sheets":["資格取得届","等級表","ChkD"],"not_rendered":{"charts":0,"images":0,"macros":1,"external_links":0,"defined_names":1,"comments":0,"pivot_tables":0},"unopened":[],"bounds":{"document_bytes":16777216,"sheet_cells":100000,"rows_first":2000,"rows_last":500,"rows_between":2000,"halvings":0,"cell_chars":16384,"cell_head_chars":4096},"cells_cut":0,"cells_raw":0,"read":"whole","date_system":"1900"}

{"sheet":"資格取得届","index":0,"n_rows":283,"n_cols":72,"rows_kept":283,"cut":false,"hidden":false,"merged":[[181,1,181,3],[97,13,99,22],[187,10,187,11],[187,13,188,17],[174,37,174,39],[177,6,178,11],[177,12,178,12],[177,13,177,18],[177,20,177,23],[178,20,179,23],[171,37,171,39],[175,24,176,26],[184,26,184,27],[177,24,177,26],[178,24,180,26],[187,19,188,23],[175,37,176,39],[156,0,157,1],[156,5,157,35],[160,0,169,0],[160,4,160,24],[161,1,163,3],[161,27,161,32],[162,27,164,32],[219,24,219,26],[197,26,197,27],[214,28,214,32],[202,37,203,39],[201,37,201,39],[202,24,203,26],[219,37,219,39],[227,26,227,27],[213,26,213,27],[197,34,199,36],[198,26,198,27],[198,37,199,39],[204,27,206,36],[201,27,203,36],[194,12,195,12],[189,27,191,36],[186,27,188,36],[178,13,180,19],[195,20,195,22],[190,4,190,9],[190,10,191,11],[179,4,180,5],[179,36,179,42],[180,28,180,34],[181,34,181,36],[182,34,184,36],[181,9,181,23],[181,24,181,33],[183,37,184,39],[261,3,261,42],[260,3,260,42],[259,3,259,42],[258,3,258,42],[250,3,250,42],[248,3,248,42],[253,3,253,42],[251,3,251,42],[249,3,249,42],[252,3,252,42],[257,3,257,42],[256,3,256,42],[255,3,255,42],[254,3,254,42],[198,40,199,43],[237,30,239,42],[237,18,239,27],[202,10,202,11],[30,0,43,0],[219,4,219,9],[223,13,225,19],[228,37,229,39],[228,40,229,43],[175,4,175,9],[175,10,176,11],[179,12,180,12],[177,4,178,5],[211,34,211,36],[183,40,184,43],[189,37,189,39],[190,24,191,26],[194,28,194,34],[194,36,194,42],[189,40,191,43],[193,24,195,26],[204,37,204,39],[179,28,179,34],[199,26,199,27],[164,1,165,3],[166,1,167,3],[166,27,166,33],[168,1,169,3],[168,27,169,43],[159,0,159,1],[162,5,163,24],[164,5,165,24],[166,5,167,24],[168,5,169,24],[98,10,99,12],[97,10,97,12],[83,0,83,2],[90,10,91,14],[45,0,58,0],[45,1,45,3],[48,1,48,3],[61,1,62,3],[56,1,58,3],[56,5,58,23],[61,10,61,11],[61,13,62,17],[65,4,65,9],[64,4,64,9],[46,1,47,3],[89,10,89,14],[82,0,82,2],[47,10,47,11],[45,4,47,9],[45,12,45,17],[45,18,45,23],[64,1,65,3],[51,4,52,5],[51,6,52,11],[21,20,21,23],[19,37,20,39],[51,12,52,12],[31,1,32,3],[53,12,54,12],[37,1,39,3],[40,1,40,3],[41,1,43,3],[30,4,32,9],[30,10,30,11],[30,12,30,17],[53,4,54,5],[49,1,50,3],[10,27,10,33],[16,13,17,17],[16,19,17,23],[18,24,18,26],[19,24,20,26],[19,13,20,22],[18,12,18,23],[15,27,17,36],[18,27,20,36],[25,34,25,36],[26,34,28,36],[15,4,17,9],[27,26,27,27],[26,26,26,27],[21,24,21,26],[24,28,24,34],[23,28,23,34],[23,36,23,42],[22,20,23,23],[24,20,24,22],[27,40,28,43],[28,28,28,32],[16,10,16,11],[17,10,17,11],[20,4,20,9],[19,4,19,9],[18,4,18,9],[26,5,28,23],[25,9,25,23],[21,13,21,18],[18,37,18,39],[16,24,17,26],[16,37,17,39],[0,0,1,1],[4,0,13,0],[4,4,4,24],[5,1,7,3],[10,1,11,3],[0,5,1,24],[15,0,28,0],[15,1,15,3],[15,10,15,11],[15,12,15,17],[15,18,15,23],[16,1,17,3],[6,5,7,24],[8,5,9,24],[10,5,11,24],[12,5,13,24],[19,10,20,11],[5,6,5,10],[8,1,9,3],[19,1,20,3],[3,0,3,1],[25,1,25,3],[21,12,22,12],[22,1,24,3],[12,1,13,3],[18,1,18,3],[22,24,24,26],[34,4,34,9],[34,10,35,11],[34,24,35,26],[35,4,35,9],[25,5,25,7],[31,10,31,11],[31,13,32,17],[31,19,32,23],[31,24,32,26],[32,10,32,11],[23,4,24,5],[21,4,22,5],[23,6,24,11],[21,6,22,11],[23,12,24,12],[22,13,24,19],[33,24,33,26],[30,18,30,23],[25,24,25,33],[28,26,28,27],[12,27,13,43],[30,40,32,43],[33,4,33,9],[36,4,37,5],[36,6,37,11],[38,36,38,42],[40,34,40,36],[41,34,43,36],[39,28,39,34],[26,1,28,3],[36,24,36,26],[31,37,32,39],[30,27,32,36],[33,27,35,36],[27,37,28,39],[33,37,33,39],[34,37,35,39],[34,1,35,3],[33,1,33,3],[30,1,30,3],[45,24,45,26],[42,37,43,39],[38,4,39,5],[38,12,39,12],[30,37,30,39],[46,13,47,17],[40,9,40,23],[40,24,40,33],[41,5,43,23],[38,6,39,11],[40,5,40,7],[41,26,41,27],[42,26,42,27],[43,26,43,27],[46,24,47,26],[43,28,43,32],[39,20,39,22],[37,13,39,19],[37,20,38,23],[36,12,37,12],[45,27,47,36],[45,10,45,11],[46,10,46,11],[30,24,30,26],[49,24,50,26],[60,0,73,0],[60,1,60,3],[46,19,47,23],[48,4,48,9],[51,24,51,26],[60,4,62,9],[63,1,63,3],[63,4,63,9],[63,24,63,26],[66,4,67,5],[66,6,67,11],[66,12,67,12],[66,13,66,18],[66,20,66,23],[66,24,66,26],[67,24,69,26],[49,4,49,9],[70,5,70,7],[70,9,70,23],[61,19,62,23],[69,20,69,22],[71,1,73,3],[70,1,70,3],[54,28,54,34],[51,20,51,23],[60,24,60,26],[52,20,53,23],[52,24,54,26],[53,28,53,34],[56,26,56,27],[57,26,57,27],[58,26,58,27],[60,27,62,36],[55,9,55,23],[51,13,51,18],[55,24,55,33],[61,24,62,26],[56,34,58,36],[55,1,55,3],[55,5,55,7],[62,10,62,11],[49,10,50,11],[60,10,60,11],[52,1,54,3],[52,13,54,19],[50,4,50,9],[60,12,60,17],[48,27,50,36],[53,6,54,11],[60,18,60,23],[67,1,69,3],[64,10,65,11],[72,40,73,43],[71,26,71,27],[72,26,72,27],[73,26,73,27],[61,37,62,39],[67,20,68,23],[67,13,69,19],[71,5,73,23],[68,4,69,5],[68,6,69,11],[68,12,69,12],[71,34,73,36],[70,24,70,33],[68,28,68,34],[70,34,70,36],[69,28,69,34],[69,38,69,42],[72,37,73,39],[73,28,73,32],[171,0,184,0],[171,4,173,9],[171,10,171,11],[171,12,171,17],[171,18,171,23],[171,24,171,26],[172,1,173,3],[172,10,172,11],[172,13,173,17],[172,19,173,23],[172,24,173,26],[173,10,173,11],[171,1,171,3],[178,1,180,3],[180,20,180,22],[174,1,174,3],[174,4,174,9],[182,1,184,3],[175,1,176,3],[176,4,176,9],[179,6,180,11],[181,5,181,7],[174,12,174,23],[175,13,176,22],[186,0,199,0],[186,1,186,3],[186,4,188,9],[186,10,186,11],[186,12,186,17],[186,18,186,23],[196,1,196,3],[196,5,196,7],[196,9,196,23],[189,1,189,3],[193,1,195,3],[190,1,191,3],[187,1,188,3],[189,12,189,23],[189,4,189,9],[197,1,199,3],[197,5,199,23],[191,4,191,9],[190,13,191,22],[192,6,193,11],[192,12,193,12],[193,13,195,19],[188,10,188,11],[192,4,193,5],[205,1,206,3],[205,4,205,9],[205,10,206,11],[203,10,203,11],[207,4,208,5],[208,1,210,3],[209,4,210,5],[202,1,203,3],[214,26,214,27],[202,19,203,23],[211,9,211,23],[202,13,203,17],[211,1,211,3],[211,5,211,7],[212,1,214,3],[212,5,214,23],[212,26,212,27],[206,4,206,9],[207,6,208,11],[207,12,208,12],[207,13,207,18],[207,20,207,23],[207,24,207,26],[208,24,210,26],[201,1,201,3],[201,4,203,9],[201,10,201,11],[201,12,201,17],[201,18,201,23],[201,24,201,26],[204,1,204,3],[204,4,204,9],[204,24,204,26],[227,1,229,3],[227,5,229,23],[227,34,229,36],[228,26,228,27],[222,4,223,5],[222,6,223,11],[222,12,223,12],[222,13,222,18],[222,20,222,23],[222,24,222,26],[223,24,225,26],[224,28,224,34],[224,36,224,42],[225,38,225,42],[229,28,229,32],[223,1,225,3],[223,20,224,23],[224,4,225,5],[224,6,225,11],[225,28,225,34],[216,0,229,0],[226,1,226,3],[226,5,226,7],[226,9,226,23],[226,24,226,33],[219,1,219,3],[219,27,221,36],[216,27,218,36],[220,10,221,11],[221,4,221,9],[220,24,221,26],[217,1,218,3],[217,10,217,11],[217,13,218,17],[217,19,218,23],[217,24,218,26],[218,10,218,11],[216,1,216,3],[220,1,221,3],[220,4,220,9],[224,12,225,12],[225,20,225,22],[229,26,229,27],[226,34,226,36],[171,40,173,43],[63,27,65,36],[216,4,218,9],[216,10,216,11],[216,12,216,17],[216,24,216,26],[205,37,206,39],[208,20,209,23],[209,6,210,11],[209,12,210,12],[210,20,210,22],[208,13,210,19],[195,28,195,34],[195,38,195,42],[192,13,192,18],[192,20,192,23],[192,24,192,26],[193,20,194,23],[190,37,191,39],[187,37,188,39],[186,24,186,26],[196,24,196,33],[187,24,188,26],[189,24,189,26],[1,41,3,43],[0,38,0,40],[0,35,0,37],[0,32,0,34],[0,29,0,31],[0,26,0,28],[1,26,3,28],[1,29,3,31],[1,32,3,34],[1,35,3,37],[1,38,3,40],[0,41,0,43],[5,27,5,32],[6,27,8,32],[24,38,24,42],[15,24,15,26],[15,37,15,39],[186,37,186,39],[37,24,39,26],[172,37,173,39],[68,36,68,42],[64,37,65,39],[64,24,65,26],[33,40,35,43],[49,37,50,39],[60,37,60,39],[63,37,63,39],[58,28,58,32],[38,28,38,34],[48,40,50,43],[54,38,54,42],[57,37,58,39],[57,40,58,43],[186,40,188,43],[174,40,176,43],[48,24,48,26],[196,34,196,36],[184,28,184,32],[102,19,102,20],[102,21,102,22],[103,17,103,18],[205,24,206,26],[199,28,199,32],[171,27,173,36],[174,27,176,36],[182,5,184,23],[182,26,182,27],[183,26,183,27],[174,24,174,26],[161,6,161,10],[102,13,104,16],[102,17,102,18],[104,21,104,22],[104,19,104,20],[103,19,103,20],[103,21,103,22],[104,17,104,18],[103,10,104,12],[194,4,195,5],[194,6,195,11],[75,36,75,42],[180,38,180,42],[201,0,214,0],[219,40,221,43],[216,40,218,43],[39,38,39,42],[42,40,43,43],[45,40,47,43],[46,37,47,39],[48,37,48,39],[55,34,55,36],[53,36,53,42],[220,37,221,39],[209,28,209,34],[209,36,209,42],[212,34,214,36],[213,40,214,43],[45,37,45,39],[213,37,214,39],[210,28,210,34],[210,38,210,42],[63,40,65,43],[60,40,62,43],[204,40,206,43],[201,40,203,43],[211,24,211,33],[237,4,237,10],[236,4,236,10],[235,4,235,10],[217,37,218,39],[216,37,216,39],[11,68,11,69],[204,12,204,23],[205,13,206,22],[219,12,219,23],[220,13,221,22],[33,12,33,23],[34,13,35,22],[48,12,48,23],[49,13,50,22],[63,12,63,23],[64,13,65,22],[216,18,216,23],[54,20,54,22],[36,13,36,18],[36,20,36,23],[15,40,17,43],[18,40,20,43]]}
["正",null,null,null,null,"健康保険　被保険者資格取得届",null,null,null,null,null,null,null,null,null,null,null,null,null,null,null,null,null,null,null,null,"常務理事",null,null,"事務局長",null,null,"部長",null,null,"課長",null,null,"課長補佐",null,null,"担当者"]
[null,null,null,null,null,null,null,null,null,null,null,null,null,null,null,null,null,null,null,null,null,null,null,null,null,null,null,null,null,null,null,null,null,null,null,null,null,null,null,null,null,null,null,null,null,null,null,"・黄色部分に入力、チェックして印刷してください。入力、チェックされた箇所は、",null,null,null,null,null,null,null,null,null,null,null,null,null,null,null,null,null,null,null,null,null,null,"副","に反映されます。"]
[null,null,null,null,null,null,null,null,null,null,null,null,null,null,null,null,null,null,null,null,null,null,null,null,null,null,null,null,null,null,null,null,null,null,null,null,null,null,null,null,null,null,null,null,null,null,null,"・印刷する際は、「A４　両面（長辺綴じ）」で印刷してください。白黒でもカラーでも結構です。"]
["令和",null,null,null,"年",null,"月",null,"日","提出",null,null,null,null,null,null,null,null,null,null,null,null,null,null,null,null,null,null,null,null,null,null,null,null,null,null,null,null,null,null,null,null,null,null,null,null,null,"・セルを結合したり、列や行を追加・削除しないでください。リセットボタンが正常に動作しなくなります。"]
["提出者記入欄",null,null,null,"　届書記入の個人番号に誤りがないことを確認しました。",null,null,null,null,null,null,null,null,null,null,null,null,null,null,null,null,null,null,null,null,null,null,null,null,null,null,null,null,null,null,null,null,null,null,null,null,null,null,null,null,null,null,"・ご使用のプリンターにより、A４用紙に納まらない場合は列や行を追加・削除するのではなく、"]
[null,"事業所\n所在地",null,null,null,"〒　　",null,null,null,null,null,null,null,null,null,null,null,null,null,null,null,null,null,null,null,null,null,"健康保険の記号",null,null,null,null,null,null,null,null,null,null,null,null,null,null,null,null,null,null,null,"　以下の方法で対応してください。"]
[null,null,null,null,null,null,null,null,null,null,null,null,null,null,null,null,null,null,null,null,null,null,null,null,null,null,null,null,null,null,null,null,null,null,null,null,null,null,null,null,null,null,null,null,null,null,null,"　　1）余白を調整する。"]
[null,null,null,null,null,null,null,null,null,null,null,null,null,null,null,null,null,null,null,null,null,null,null,null,null,null,null,null,null,null,null,null,null,null,null,null,null,null,null,null,null,null,null,null,null,null,null,"　　2）印刷を拡大・縮小する。"]
[null,"事業所\n名　称",null,null,null,null,null,null,null,null,null,null,null,null,null,null,null,null,null,null,null,null,null,null,null,null,null,null,null,null,null,null,null,null,null,null,null,null,null,null,null,null,null,null,null,null,null,"　　3）空欄の「行」の高さを調整する"]
[]
[null,"事業主\n氏　名",null,null,"　　　　　　　　　　　　　　　　　　　　　　　　　　　　　　　　　　　　　　　　　\n　　　　　　　　　　　　　　　　　　　　　　　　　　　　　　　　　　　　　　　　　　　　　　　　",null,null,null,null,null,null,null,null,null,null,null,null,null,null,null,null,null,null,null,null,null,null,"社会保険労務士記載欄",null,null,null,null,null,null,null,null,null,null,null,null,null,null,null,null,null,null,null,"前回入力した情報を保存している場合は、別人の情報が残るのを避けるため"]
[null,null,null,null,null,null,null,null,null,null,null,null,null,null,null,null,null,null,null,null,null,null,null,null,null,null,"　","　　氏　　名　　等",null,null,null,null,null,null,null,null,null,null,null,null,null,null,null,null,null,null,null,"下のリセットボタンを押して、全て消去してから入力してください。",null,null,null,null,null,null,null,null,null,null,null,null,null,null,null,null,null,null,null,null,"→"]
[null,"電話番号"]
[]
[]
["被保険者１","①",null,null,null,null,null,null,null,null,"②",null,null,null,null,null,null,null,null,null,null,null,null,null,"③",null,null,null,null,null,null,null,null,null,null,null,null,"④"]
[null,"被保険者\n等番号",null,null,null,null,null,null,null,null,"(ﾌﾘｶﾞﾅ)",null,"（氏）",null,null,null,null,null,"（名）",null,null,null,null,null,"生 年\n月 日",null,null,null,null,null,null,null,null,null,null,null,null,"性別\n(ﾌﾟﾙﾀﾞｳﾝ)"]
[null,null,null,null,null,null,null,null,null,null,"氏名"]
[null,"⑤",null,null,"　1. 健保・厚年",null,null,null,null,null,"⑥",null,null,null,null,null,null,null,null,null,null,null,null,null,"⑦",null,null,null,null,null,null,null,null,null,null,null,null,"⑧"]
[null,"取 得\n区 分",null,null,"　3. 共済出向",null,null,null,null,null,"個 人\n番 号",null,null,null,null,null,null,null,null,null,null,null,null,null,"取得(該当)\n年月日",null,null,null,null,null,null,null,null,null,null,null,null,"被扶養者\n(ﾌﾟﾙﾀﾞｳﾝ)"]
[null,null,null,null,"　4 .船保任継",null,null,null,null,null,null,null,null,null,null,null,null,null,null,null,null,null,null,null,null,null,null,null,null,null,null,null,null,null,null,null,null,null,null,null,null,null,null,null,null,{"$f":"ChkD!F2","v":""}]
[null,"⑨　　　　　\n　 ",null,null,"㋐（通貨）",null,null,null,null,null,null,null,"円","㋒（合計㋐＋㋑）",null,null,null,null,null,"円","⑩標準報酬月額",null,null,null,"⑪",null,null,"該当する項目にチェックを入れてください。"]
[null,"報 酬\n月 額",null,null,null,null,null,null,null,null,null,null,null,{"$f":"IF(G22=(\"\"),(\"\"),G22+G24)","v":""},null,null,null,null,null,null,{"$f":"IF(N23=(\"\"),(\"\"),VLOOKUP(N23,等級表!A:C,3,1))","v":""},null,null,null,"備 考"]
[null,null,null,null,"㋑（現物）",null,null,null,null,null,null,null,"円",null,null,null,null,null,null,null,null,null,null,null,null,null,null,false,"二以上事業所勤務者の取得",null,null,null,null,null,null,null,"退職後の継続再雇用者の取得"]
[null,null,null,null,null,null,null,null,null,null,null,null,null,null,null,null,null,null,null,null,null,null,null,"千円",null,null,null,false,"短時間労働者の取得(特定適用事業所等)",null,null,null,null,null,null,null,"その他","（　　　　　　　　　　　　　　　　　　　　　　）",null,null,null,null,null,"）"]
[null,"⑫",null,null,"〒",null,null,null,null,null,null,null,null,null,null,null,null,null,null,null,null,null,null,null,"住所が空欄の場合は該当する項目にチェックを入れてください。",null,null,null,null,null,null,null,null,null,"⑬",null,null,"発行が必要の場合はチェックを"]
[null,"住民票\n住所",null,null,null,null,null,null,null,null,null,null,null,null,null,null,null,null,null,null,null,null,null,null,false,null,"海外在住",null,null,null,null,null,null,null,"資格確認書\n発行要否",null,null,"入れてください。"]
[null,null,null,null,null,null,null,null,null,null,null,null,null,null,null,null,null,null,null,null,null,null,null,null,false,null,"短期在留",null,null,null,null,null,null,null,null,null,null,false,null,null,"発行が必要"]
[null,null,null,null,null,null,null,null,null,null,null,null,null,null,null,null,null,null,null,null,null,null,null,null,false,null,"その他（",null,null,null,null,null,null,"）"]
[]
["被保険者２","①",null,null,null,null,null,null,null,null,"②",null,null,null,null,null,null,null,null,null,null,null,null,null,"③",null,null,null,null,null,null,null,null,null,null,null,null,"④"]
[null,"被保険者\n等番号",null,null,null,null,null,null,null,null,"(ﾌﾘｶﾞﾅ)",null,"（氏）",null,null,null,null,null,"（名）",null,null,null,null,null,"生 年\n月 日",null,null,null,null,null,null,null,null,null,null,null,null,"性別\n(ﾌﾟﾙﾀﾞｳﾝ)"]
[null,null,null,null,null,null,null,null,null,null,"氏名"]
[null,"⑤",null,null,"　1. 健保・厚年",null,null,null,null,null,"⑥",null,null,null,null,null,null,null,null,null,null,null,null,null,"⑦",null,null,null,null,null,null,null,null,null,null,null,null,"⑧"]
[null,"取 得\n区 分",null,null,"　3. 共済出向",null,null,null,null,null,"個 人\n番 号",null,null,null,null,null,null,null,null,null,null,null,null,null,"取得(該当)\n年月日",null,null,null,null,null,null,null,null,null,null,null,null,"被扶養者\n(ﾌﾟﾙﾀﾞｳﾝ)"]
[null,null,null,null,"　4 .船保任継",null,null,null,null,null,null,null,null,null,null,null,null,null,null,null,null,null,null,null,null,null,null,null,null,null,null,null,null,null,null,null,null,null,null,null,null,null,null,null,null,{"$f":"ChkD!F3","v":""}]
[null,"⑨　　　　　\n　 ",null,null,"㋐（通貨）",null,null,null,null,null,null,null,"円","㋒（合計㋐＋㋑）",null,null,null,null,null,"円","⑩標準報酬月額",null,null,null,"⑪",null,null,"該当する項目にチェックを入れてください。"]
[null,"報 酬\n月 額",null,null,null,null,null,null,null,null,null,null,null,{"$f":"IF(G37=(\"\"),(\"\"),G37+G39)","v":""},null,null,null,null,null,null,{"$f":"IF(N38=(\"\"),(\"\"),VLOOKUP(N38,等級表!A:C,3,1))","v":""},null,null,null,"備 考"]
[null,null,null,null,"㋑（現物）",null,null,null,null,null,null,null,"円",null,null,null,null,null,null,null,null,null,null,null,null,null,null,null,"二以上事業所勤務者の取得",null,null,null,null,null,null,null,"退職後の継続再雇用者の取得"]
[null,null,null,null,null,null,null,null,null,null,null,null,null,null,null,null,null,null,null,null,null,null,null,"千円",null,null,null,null,"短時間労働者の取得(特定適用事業所等)",null,null,null,null,null,null,null,"その他","（　　　　　　　　　　　　　　　　　　　　　　）",null,null,null,null,null,"）"]
{"$rows_left_out":244}
{"sheet":"等級表","index":1,"n_rows":51,"n_cols":4,"rows_kept":51,"cut":false,"hidden":true,"merged":[]}
["以上","未満","標準報酬月額","等　級"]
[0,63000,58,1]
[63000,73000,68,2]
[73000,83000,78,3]
[83000,93000,88,4]
[93000,101000,98,5]
[101000,107000,104,6]
[107000,114000,110,7]
[114000,122000,118,8]
[122000,130000,126,9]
[130000,138000,134,10]
[138000,146000,142,11]
[146000,155000,150,12]
[155000,165000,160,13]
[165000,175000,170,14]
[175000,185000,180,15]
[185000,195000,190,16]
[195000,210000,200,17]
[210000,230000,220,18]
[230000,250000,240,19]
[250000,270000,260,20]
[270000,290000,280,21]
[290000,310000,300,22]
[310000,330000,320,23]
[330000,350000,340,24]
[350000,370000,360,25]
[370000,395000,380,26]
[395000,425000,410,27]
[425000,455000,440,28]
[455000,485000,470,29]
[485000,515000,500,30]
[515000,545000,530,31]
[545000,575000,560,32]
[575000,605000,590,33]
[605000,635000,620,34]
[635000,665000,650,35]
[665000,695000,680,36]
[695000,730000,710,37]
[730000,770000,750,38]
[770000,810000,790,39]
{"$rows_left_out":12}
{"sheet":"ChkD","index":2,"n_rows":5,"n_cols":6,"rows_kept":5,"cut":false,"hidden":true,"merged":[]}
["MN","一桁目","正誤","桁数確認","桁","メッセージ"]
[{"$f":"IF(資格取得届!N20=(\"\"),(\"\"),資格取得届!N20)","v":""},{"$f":"IF(MOD(VALUE(2*VALUE(MID(D2,11,1)))+VALUE(3*VALUE(MID(D2,10,1)))+VALUE(4*VALUE(MID(D2,9,1)))+VALUE(5*VALUE(MID(D2,8,1)))+VALUE(6*VALUE(MID(D2,7,1)))+VALUE(7*VALUE(MID(D2,6,1)))+VALUE(2*VALUE(MID(D2,5,1)))+VALUE(3*VALUE(MID(D2,4,1)))+VALUE(4*VALUE(MID(D2,3,1)))+VALUE(5*VALUE(MID(D2,2,1)))+VALUE(6*VALUE(MID(D2,1,1))),11)<=1,0,11-MOD(VALUE(2*VALUE(MID(D2,11,1)))+VALUE(3*VALUE(MID(D2,10,1)))+VALUE(4*VALUE(MID(D2,9,1)))+VALUE(5*VALUE(MID(D2,8,1)))+VALUE(6*VALUE(MID(D2,7,1)))+VALUE(7*VALUE(MID(D2,6,1)))+VALUE(2*VALUE(MID(D2,5,1)))+VALUE(3*VALUE(MID(D2,4,1)))+VALUE(4*VALUE(MID(D2,3,1)))+VALUE(5*VALUE(MID(D2,2,1)))+VALUE(6*VALUE(MID(D2,1,1))),11))","v":{"$error":"#VALUE!"}},{"$f":"IF(E2>=13,E2,VALUE(RIGHT(A2,1))=B2)","v":{"$error":"#VALUE!"}},{"$f":"IF(A2=(\"\"),(\"\"),TEXT(A2,\"000000000000\"))","v":""},{"$f":"LEN(D2)","v":0},{"$f":"IF(A2=(\"\"),(\"\"),IF(C2=TRUE,(\"\"),IF(C2=FALSE,\"マイナンバーが違っています。\",IF(C2>=13,C2&\"桁数の入力があります。\",(\"\")))))","v":""}]
[{"$f":"IF(資格取得届!N35=(\"\"),(\"\"),資格取得届!N35)","v":""},{"$f":"IF(MOD(VALUE(2*VALUE(MID(D3,11,1)))+VALUE(3*VALUE(MID(D3,10,1)))+VALUE(4*VALUE(MID(D3,9,1)))+VALUE(5*VALUE(MID(D3,8,1)))+VALUE(6*VALUE(MID(D3,7,1)))+VALUE(7*VALUE(MID(D3,6,1)))+VALUE(2*VALUE(MID(D3,5,1)))+VALUE(3*VALUE(MID(D3,4,1)))+VALUE(4*VALUE(MID(D3,3,1)))+VALUE(5*VALUE(MID(D3,2,1)))+VALUE(6*VALUE(MID(D3,1,1))),11)<=1,0,11-MOD(VALUE(2*VALUE(MID(D3,11,1)))+VALUE(3*VALUE(MID(D3,10,1)))+VALUE(4*VALUE(MID(D3,9,1)))+VALUE(5*VALUE(MID(D3,8,1)))+VALUE(6*VALUE(MID(D3,7,1)))+VALUE(7*VALUE(MID(D3,6,1)))+VALUE(2*VALUE(MID(D3,5,1)))+VALUE(3*VALUE(MID(D3,4,1)))+VALUE(4*VALUE(MID(D3,3,1)))+VALUE(5*VALUE(MID(D3,2,1)))+VALUE(6*VALUE(MID(D3,1,1))),11))","v":{"$error":"#VALUE!"}},{"$f":"IF(E3>=13,E3,VALUE(RIGHT(A3,1))=B3)","v":{"$error":"#VALUE!"}},{"$f":"IF(A3=(\"\"),(\"\"),TEXT(A3,\"000000000000\"))","v":""},{"$f":"LEN(D3)","v":0},{"$f":"IF(A3=(\"\"),(\"\"),IF(C3=TRUE,(\"\"),IF(C3=FALSE,\"マイナンバーが違っています。\",IF(C3>=13,C3&\"桁数の入力があります。\",(\"\")))))","v":""}]
[{"$f":"IF(資格取得届!N50=(\"\"),(\"\"),資格取得届!N50)","v":""},{"$f":"IF(MOD(VALUE(2*VALUE(MID(D4,11,1)))+VALUE(3*VALUE(MID(D4,10,1)))+VALUE(4*VALUE(MID(D4,9,1)))+VALUE(5*VALUE(MID(D4,8,1)))+VALUE(6*VALUE(MID(D4,7,1)))+VALUE(7*VALUE(MID(D4,6,1)))+VALUE(2*VALUE(MID(D4,5,1)))+VALUE(3*VALUE(MID(D4,4,1)))+VALUE(4*VALUE(MID(D4,3,1)))+VALUE(5*VALUE(MID(D4,2,1)))+VALUE(6*VALUE(MID(D4,1,1))),11)<=1,0,11-MOD(VALUE(2*VALUE(MID(D4,11,1)))+VALUE(3*VALUE(MID(D4,10,1)))+VALUE(4*VALUE(MID(D4,9,1)))+VALUE(5*VALUE(MID(D4,8,1)))+VALUE(6*VALUE(MID(D4,7,1)))+VALUE(7*VALUE(MID(D4,6,1)))+VALUE(2*VALUE(MID(D4,5,1)))+VALUE(3*VALUE(MID(D4,4,1)))+VALUE(4*VALUE(MID(D4,3,1)))+VALUE(5*VALUE(MID(D4,2,1)))+VALUE(6*VALUE(MID(D4,1,1))),11))","v":{"$error":"#VALUE!"}},{"$error":"#VALUE!"},{"$f":"IF(A4=(\"\"),(\"\"),TEXT(A4,\"000000000000\"))","v":""},{"$f":"LEN(D4)","v":0},{"$f":"IF(A4=(\"\"),(\"\"),IF(C4=TRUE,(\"\"),IF(C4=FALSE,\"マイナンバーが違っています。\",IF(C4>=13,C4&\"桁数の入力があります。\",(\"\")))))","v":""}]
[{"$f":"IF(資格取得届!N65=(\"\"),(\"\"),資格取得届!N65)","v":""},{"$f":"IF(MOD(VALUE(2*VALUE(MID(D5,11,1)))+VALUE(3*VALUE(MID(D5,10,1)))+VALUE(4*VALUE(MID(D5,9,1)))+VALUE(5*VALUE(MID(D5,8,1)))+VALUE(6*VALUE(MID(D5,7,1)))+VALUE(7*VALUE(MID(D5,6,1)))+VALUE(2*VALUE(MID(D5,5,1)))+VALUE(3*VALUE(MID(D5,4,1)))+VALUE(4*VALUE(MID(D5,3,1)))+VALUE(5*VALUE(MID(D5,2,1)))+VALUE(6*VALUE(MID(D5,1,1))),11)<=1,0,11-MOD(VALUE(2*VALUE(MID(D5,11,1)))+VALUE(3*VALUE(MID(D5,10,1)))+VALUE(4*VALUE(MID(D5,9,1)))+VALUE(5*VALUE(MID(D5,8,1)))+VALUE(6*VALUE(MID(D5,7,1)))+VALUE(7*VALUE(MID(D5,6,1)))+VALUE(2*VALUE(MID(D5,5,1)))+VALUE(3*VALUE(MID(D5,4,1)))+VALUE(4*VALUE(MID(D5,3,1)))+VALUE(5*VALUE(MID(D5,2,1)))+VALUE(6*VALUE(MID(D5,1,1))),11))","v":{"$error":"#VALUE!"}},{"$error":"#VALUE!"},"",0,{"$f":"IF(A5=(\"\"),(\"\"),IF(C5=TRUE,(\"\"),IF(C5=FALSE,\"マイナンバーが違っています。\",IF(C5>=13,C5&\"桁数の入力があります。\",(\"\")))))","v":""}]